{"text_format":"1","workbook":"xlsx","n_sheets":13,"sheets":["設定","申込手順","男子入力シート","女子入力シート","男子団体メンバー用紙印刷","女子団体メンバー用紙印刷","申込書＿男子団体","申込書＿女子団体","申込書＿男子個人","申込書＿女子個人","申込選手一覧（個人）","申込選手一覧sort（個人）","プログラム"],"not_rendered":{"charts":0,"images":2,"macros":1,"external_links":0,"defined_names":8,"comments":0,"pivot_tables":0},"unopened":[],"bounds":{"document_bytes":16777216,"sheet_cells":100000,"rows_first":2000,"rows_last":500,"rows_between":2000,"halvings":0,"cell_chars":16384,"cell_head_chars":4096},"cells_cut":0,"cells_raw":0,"read":"whole","date_system":"1900"}

{"sheet":"設定","index":0,"n_rows":253,"n_cols":26,"rows_kept":253,"cut":false,"hidden":true,"merged":[]}
["学年",null,"段位",null,"西暦",null,"月",null,"日",null,"男子階級",null,"女子階級",null,"番号","校名","校名略",null,"申込締切年","申込締切月","申込締切日",null,"Ver",null,"大会回高校","中学"]
[1,null,"無",null,{"$f":"YEAR(TODAY())-F2","v":2006},20,1,null,1,null,60,null,"52以下",null,301,"旭","旭",null,2026,4,9,null,20260308,null,73,{"$f":"Y2-44","v":29}]
[2,null,"初",null,{"$f":"YEAR(TODAY())-F3","v":2007},19,2,null,2,null,66,null,"63以下",null,302,"枚方なぎさ","枚方なぎ"]
[3,null,"弐",null,2008,18,3,null,3,null,73,null,"無差別",null,303,"大手前","大 手 前"]
[null,null,"参",null,2009,17,4,null,4,null,81,null,null,null,304,"大阪わかば","わ か ば"]
[null,null,null,null,2010,16,5,null,5,null,90,null,null,null,305,"門真なみはや","門真なみ"]
[null,null,null,null,2011,15,6,null,6,null,100,null,null,null,306,"門真西","門 真 西"]
[null,null,null,null,{"$f":"YEAR(TODAY())-F8","v":2012},14,7,null,7,null,"100+",null,null,null,308,"香里丘","香 里 丘"]
[null,null,null,null,2013,13,8,null,8,null,null,null,null,null,309,"高津","高　　津"]
[null,null,null,null,2014,12,9,null,9,null,null,null,null,null,310,"四條畷","四 條 畷"]
{"$rows_left_out":244}
{"sheet":"申込手順","index":1,"n_rows":15,"n_cols":11,"rows_kept":15,"cut":false,"hidden":false,"merged":[]}
[]
["①","入力シートに必要事項を記入し",null,null,null,null,null,null,null,"をクリックしてください。　郵送用の申込用紙が印刷されます。"]
[null,"※用紙は「B5」でお願いします。　(団体はB5　1枚　　個人は2名でB5　1枚　に印刷されます）"]
[]
["②","印刷された、申込用紙に「公印」を押して、期日までに所定の申込先に郵送してください。"]
[null,null,"〒590-0459　泉南郡熊取町朝代代1-1　TEL 072-453-7001"]
[null,null,"大阪体育大学浪商高等学校　　　寺居　史朗　宛"]
[]
[null,null,"申込締切日：",{"$f":"設定!S2","v":2026},"年",{"$f":"設定!T2","v":4},"月",{"$f":"設定!U2","v":9},"日",{"$f":"\"（\"&TEXT(DATE(D9,F9,H9),\"aaa\")&\"）\"","v":"（木）"},"正午　※郵送・メール共"]
[]
{"$rows_left_out":6}
{"sheet":"男子入力シート","index":2,"n_rows":36,"n_cols":14,"rows_kept":36,"cut":false,"hidden":false,"merged":[[1,11,2,13],[4,12,4,13],[6,7,7,7],[6,8,7,8],[6,10,7,10],[6,9,7,9],[3,12,3,13],[20,7,21,7],[20,8,21,8],[20,9,21,9],[20,10,21,10],[20,2,21,2]]}
[]
[null,"学校番号：",null,{"$f":"IF(C2=\"\",\"学校番号が入力されていません。\",IF(C2=598,VLOOKUP(C2,校名[],2,FALSE),VLOOKUP(C2,校名[],2,FALSE)&\"高等学校\"))","v":"学校番号が入力されていません。"},null,null,null,null,null,null,null,"【入　力　項　目】"]
[]
[null,null,"監督名：",null,"校長名：",null,null,null,null,null,null,"必須入力","リストから\n選択"]
[null,"※ふりがなは自動で入力されますが、違う場合は直接入力してください。",null,null,null,null,null,null,null,null,null,"直接入力","入力済み"]
[null,"男子団体",null,null,{"$f":"\"第\"&設定!Y2&\"回大阪私立高等学校総合体育大会　申込書\"","v":"第73回大阪私立高等学校総合体育大会　申込書"}]
[null,null,"抽選番号","選手名（ふりがな）",null,null,null,"学年","段位","体重(kg)","身長(cm)","生年月日"]
[null,null,null,"姓","名","せい","めい",null,null,null,null,"年(西暦)","月","日"]
[null,null,"先鋒",null,null,{"$f":"PHONETIC(D9)","v":""},{"$f":"PHONETIC(E9)","v":""}]
[null,null,"次鋒",null,null,"",""]
{"$rows_left_out":27}
{"sheet":"女子入力シート","index":3,"n_rows":33,"n_cols":14,"rows_kept":33,"cut":false,"hidden":false,"merged":[[17,2,18,2],[17,7,18,7],[17,8,18,8],[17,9,18,9],[17,10,18,10],[1,11,2,13],[3,12,3,13],[4,12,4,13],[6,7,7,7],[6,8,7,8],[6,9,7,9],[6,10,7,10]]}
[]
[null,"学校番号：",null,{"$f":"IF(C2=\"\",\"学校番号が入力されていません。\",IF(C2=598,VLOOKUP(C2,校名[],2,FALSE),VLOOKUP(C2,校名[],2,FALSE)&\"高等学校\"))","v":"学校番号が入力されていません。"},null,null,null,null,null,null,null,"【入　力　項　目】"]
[]
[null,null,"監督名：",null,"校長名：",null,null,null,null,null,null,"必須入力","リストから\n選択"]
[null,"※ふりがなは自動で入力されますが、違う場合は直接入力してください。",null,null,null,null,null,null,null,null,null,"直接入力","入力済み"]
[null,"女子団体",null,null,{"$f":"男子入力シート!E6","v":"第73回大阪私立高等学校総合体育大会　申込書"}]
[null,null,"抽選番号","選手名（ふりがな）",null,null,null,"学年","段位","体重(kg)","身長(cm)","生年月日"]
[null,null,null,"姓","名","せい","めい",null,null,null,null,"年(西暦)","月","日"]
[null,null,"先鋒",null,null,{"$f":"PHONETIC(D9)","v":""},""]
[null,null,"中堅",null,null,"",""]
{"$rows_left_out":24}
{"sheet":"男子団体メンバー用紙印刷","index":4,"n_rows":23,"n_cols":12,"rows_kept":23,"cut":false,"hidden":false,"merged":[[1,6,1,9],[2,6,17,9],[19,10,21,10]]}
[]
[1," ",{"$f":"IF(男子入力シート!$C$2=\"\",\"\",VLOOKUP(男子入力シート!$C$2,校名[],3,FALSE))","v":""},1,null,null,{"$f":"INDEX(B2:B10,MATCH(K20,A2:A10))","v":" "}]
[2,"先",{"$f":"IF(男子入力シート!D9=\"\",\"\",男子入力シート!D9)","v":""},{"$f":"IF(C3=\"\",1,COUNTIF($C$3:$C$10,C3))","v":1},{"$f":"IF(D3>=2,LEFT(男子入力シート!E9,1),\"\")","v":""},null,{"$f":"INDEX(C2:C10,MATCH(K20,A2:A10))","v":""}]
[3,"次",{"$f":"IF(男子入力シート!D10=\"\",\"\",男子入力シート!D10)","v":""},1,{"$f":"IF(D4>=2,LEFT(男子入力シート!E10,1),\"\")","v":""}]
[4,"中",{"$f":"IF(男子入力シート!D11=\"\",\"\",男子入力シート!D11)","v":""},1,{"$f":"IF(D5>=2,LEFT(男子入力シート!E11,1),\"\")","v":""}]
[5,"副",{"$f":"IF(男子入力シート!D12=\"\",\"\",男子入力シート!D12)","v":""},1,{"$f":"IF(D6>=2,LEFT(男子入力シート!E12,1),\"\")","v":""}]
[6,"大",{"$f":"IF(男子入力シート!D13=\"\",\"\",男子入力シート!D13)","v":""},1,{"$f":"IF(D7>=2,LEFT(男子入力シート!E13,1),\"\")","v":""}]
[7," ",{"$f":"IF(男子入力シート!D14=\"\",\"\",男子入力シート!D14)","v":""},1,{"$f":"IF(D8>=2,LEFT(男子入力シート!E14,1),\"\")","v":""}]
[8," ",{"$f":"IF(男子入力シート!D15=\"\",\"\",男子入力シート!D15)","v":""},{"$f":"IF(C9=\"\",1,COUNTIF($C$3:$C$10,C9))","v":1},{"$f":"IF(D9>=2,LEFT(男子入力シート!E15,1),\"\")","v":""}]
[9," ",{"$f":"IF(男子入力シート!D16=\"\",\"\",男子入力シート!D16)","v":""},1,{"$f":"IF(D10>=2,LEFT(男子入力シート!E16,1),\"\")","v":""}]
{"$rows_left_out":14}
{"sheet":"女子団体メンバー用紙印刷","index":5,"n_rows":23,"n_cols":12,"rows_kept":23,"cut":false,"hidden":false,"merged":[[1,6,1,9],[2,6,17,9],[19,10,21,10]]}
[]
[1," ",{"$f":"IF(女子入力シート!$C$2=\"\",\"\",VLOOKUP(女子入力シート!$C$2,校名[],3,FALSE))","v":""},1,null,null,{"$f":"INDEX(B2:B10,MATCH(K20,A2:A10))","v":" "}]
[2,"先",{"$f":"IF(女子入力シート!D9=\"\",\"\",女子入力シート!D9)","v":""},{"$f":"IF(C3=\"\",1,COUNTIF($C$3:$C$10,C3))","v":1},{"$f":"IF(D3>=2,LEFT(女子入力シート!E9,1),\"\")","v":""},null,{"$f":"INDEX(C2:C10,MATCH(K20,A2:A10))","v":""}]
[3,"中",{"$f":"IF(女子入力シート!D10=\"\",\"\",女子入力シート!D10)","v":""},1,{"$f":"IF(D4>=2,LEFT(女子入力シート!E10,1),\"\")","v":""}]
[4,"大",{"$f":"IF(女子入力シート!D11=\"\",\"\",女子入力シート!D11)","v":""},1,{"$f":"IF(D5>=2,LEFT(女子入力シート!E11,1),\"\")","v":""}]
[5,null,{"$f":"IF(女子入力シート!D12=\"\",\"\",女子入力シート!D12)","v":""},1,{"$f":"IF(D6>=2,LEFT(女子入力シート!E12,1),\"\")","v":""}]
[6,null,{"$f":"IF(女子入力シート!D13=\"\",\"\",女子入力シート!D13)","v":""},1,{"$f":"IF(D7>=2,LEFT(女子入力シート!E13,1),\"\")","v":""}]
[null," ",{"$f":"IF(女子入力シート!D14=\"\",\"\",女子入力シート!D14)","v":""},1,{"$f":"IF(D8>=2,LEFT(女子入力シート!E14,1),\"\")","v":""}]
[null," "]
[null," "]
{"$rows_left_out":14}
{"sheet":"申込書＿男子団体","index":6,"n_rows":22,"n_cols":10,"rows_kept":22,"cut":false,"hidden":false,"merged":[[18,8,19,8],[18,9,19,9],[19,2,19,3],[18,1,19,1],[18,2,18,3],[18,5,19,5],[18,6,19,6],[18,7,19,7],[6,1,7,1],[6,2,6,3],[7,2,7,3],[3,2,3,4],[2,2,2,4],[3,5,3,7],[3,8,3,9],[5,2,5,4],[4,2,4,4],[4,9,5,9],[4,8,5,8],[4,7,5,7],[4,6,5,6],[4,5,5,5],[10,8,11,8],[2,8,2,9],[2,5,2,7],[8,1,9,1],[8,2,8,3],[8,5,9,5],[8,6,9,6],[8,7,9,7],[8,8,9,8],[8,9,9,9],[9,2,9,3],[6,9,7,9],[6,8,7,8],[6,7,7,7],[6,6,7,6],[6,5,7,5],[14,8,15,8],[10,9,11,9],[11,2,11,3],[12,1,13,1],[12,2,12,3],[12,5,13,5],[12,6,13,6],[12,7,13,7],[12,8,13,8],[12,9,13,9],[13,2,13,3],[10,1,11,1],[10,2,10,3],[10,5,11,5],[10,6,11,6],[10,7,11,7],[1,3,1,7],[14,9,15,9],[15,2,15,3],[16,1,17,1],[16,2,16,3],[16,5,17,5],[16,6,17,6],[16,7,17,7],[16,8,17,8],[16,9,17,9],[17,2,17,3],[14,1,15,1],[14,2,14,3],[14,5,15,5],[14,6,15,6],[14,7,15,7],[20,8,21,8],[20,9,21,9],[21,2,21,3],[20,1,21,1],[20,2,20,3],[20,5,21,5],[20,6,21,6],[20,7,21,7]]}
[]
[null,"※抽選番号",null,{"$f":"男子入力シート!E6","v":"第73回大阪私立高等学校総合体育大会　申込書"},null,null,null,null,null,{"$f":"NOW()","v":"2026-03-24T17:32:13.950"}]
[null,"学校番号","学　　校　　名",null,null,"監　督　名",null,null,"校　長　名"]
[null,{"$f":"IF(男子入力シート!$C$2=\"\",\"\",男子入力シート!$C$2)","v":""},{"$f":"IF(ISERROR(男子入力シート!$D$2),\"\",男子入力シート!$D$2)","v":"学校番号が入力されていません。"},null,null,{"$f":"IF(男子入力シート!$D$4=\"\",\"監督名が入力されていません\",男子入力シート!$D$4)","v":"監督名が入力されていません"},null,null,{"$f":"IF(男子入力シート!$F$4=\"\",\"校長名が入力されていません\",男子入力シート!$F$4)","v":"校長名が入力されていません"}]
[null,null,"ふ　り　が　な",null,null,"学年","段位","体重(kg)","身長(cm)","生年月日(西暦)"]
[null,null,"選　　手　　名"]
[null,"先鋒",{"$f":"IF(男子入力シート!F9=\"\",\"\",男子入力シート!F9)","v":""},null,{"$f":"IF(男子入力シート!G9=\"\",\"\",男子入力シート!G9)","v":""},{"$f":"IF(男子入力シート!H9=\"\",\"\",男子入力シート!H9)","v":""},{"$f":"IF(男子入力シート!I9=\"\",\"\",男子入力シート!I9)","v":""},{"$f":"IF(男子入力シート!J9=\"\",\"\",男子入力シート!J9)","v":""},{"$f":"IF(男子入力シート!K9=\"\",\"\",男子入力シート!K9)","v":""},{"$f":"IF(OR(男子入力シート!L9=\"\",男子入力シート!M9=\"\",男子入力シート!N9=\"\"),\"\",男子入力シート!L9&\"・\"&男子入力シート!M9&\"・\"&男子入力シート!N9)","v":""}]
[null,null,{"$f":"IF(男子入力シート!D9=\"\",\"\",男子入力シート!D9)","v":""},null,{"$f":"IF(男子入力シート!E9=\"\",\"\",男子入力シート!E9)","v":""}]
[null,"次鋒",{"$f":"IF(男子入力シート!F10=\"\",\"\",男子入力シート!F10)","v":""},null,{"$f":"IF(男子入力シート!G10=\"\",\"\",男子入力シート!G10)","v":""},{"$f":"IF(男子入力シート!H10=\"\",\"\",男子入力シート!H10)","v":""},{"$f":"IF(男子入力シート!I10=\"\",\"\",男子入力シート!I10)","v":""},{"$f":"IF(男子入力シート!J10=\"\",\"\",男子入力シート!J10)","v":""},{"$f":"IF(男子入力シート!K10=\"\",\"\",男子入力シート!K10)","v":""},{"$f":"IF(OR(男子入力シート!L10=\"\",男子入力シート!M10=\"\",男子入力シート!N10=\"\"),\"\",男子入力シート!L10&\"・\"&男子入力シート!M10&\"・\"&男子入力シート!N10)","v":""}]
[null,null,{"$f":"IF(男子入力シート!D10=\"\",\"\",男子入力シート!D10)","v":""},null,{"$f":"IF(男子入力シート!E10=\"\",\"\",男子入力シート!E10)","v":""}]
{"$rows_left_out":13}
{"sheet":"申込書＿女子団体","index":7,"n_rows":16,"n_cols":10,"rows_kept":16,"cut":false,"hidden":false,"merged":[[4,9,5,9],[5,2,5,4],[1,3,1,7],[2,2,2,4],[2,5,2,7],[2,8,2,9],[3,2,3,4],[3,5,3,7],[3,8,3,9],[4,2,4,4],[4,5,5,5],[4,6,5,6],[4,7,5,7],[4,8,5,8],[6,9,7,9],[7,2,7,3],[8,1,9,1],[8,2,8,3],[8,5,9,5],[8,6,9,6],[8,7,9,7],[8,8,9,8],[8,9,9,9],[9,2,9,3],[6,1,7,1],[6,2,6,3],[6,5,7,5],[6,6,7,6],[6,7,7,7],[6,8,7,8],[10,9,11,9],[11,2,11,3],[12,1,13,1],[12,2,12,3],[12,5,13,5],[12,6,13,6],[12,7,13,7],[12,8,13,8],[12,9,13,9],[13,2,13,3],[10,1,11,1],[10,2,10,3],[10,5,11,5],[10,6,11,6],[10,7,11,7],[10,8,11,8],[14,9,15,9],[15,2,15,3],[14,1,15,1],[14,2,14,3],[14,5,15,5],[14,6,15,6],[14,7,15,7],[14,8,15,8]]}
[]
[null,"※抽選番号",null,{"$f":"女子入力シート!E6","v":"第73回大阪私立高等学校総合体育大会　申込書"},null,null,null,null,null,{"$f":"NOW()","v":"2026-03-24T17:32:13.950"}]
[null,"学校番号","学　　校　　名",null,null,"監　督　名",null,null,"校　長　名"]
[null,{"$f":"IF(女子入力シート!$C$2=\"\",\"\",女子入力シート!$C$2)","v":""},{"$f":"IF(ISERROR(女子入力シート!$D$2),\"\",女子入力シート!$D$2)","v":"学校番号が入力されていません。"},null,null,{"$f":"IF(女子入力シート!$D$4=\"\",\"監督名が入力されていません\",女子入力シート!$D$4)","v":"監督名が入力されていません"},null,null,{"$f":"IF(女子入力シート!$F$4=\"\",\"校長名が入力されていません\",女子入力シート!$F$4)","v":"校長名が入力されていません"}]
[null,null,"ふ　り　が　な",null,null,"学年","段位","体重(kg)","身長(cm)","生年月日(西暦)"]
[null,null,"選　　手　　名"]
[null,"先鋒",{"$f":"IF(女子入力シート!F9=\"\",\"\",女子入力シート!F9)","v":""},null,{"$f":"IF(女子入力シート!G9=\"\",\"\",女子入力シート!G9)","v":""},{"$f":"IF(女子入力シート!H9=\"\",\"\",女子入力シート!H9)","v":""},{"$f":"IF(女子入力シート!I9=\"\",\"\",女子入力シート!I9)","v":""},{"$f":"IF(女子入力シート!J9=\"\",\"\",女子入力シート!J9)","v":""},{"$f":"IF(女子入力シート!K9=\"\",\"\",女子入力シート!K9)","v":""},{"$f":"IF(OR(女子入力シート!L9=\"\",女子入力シート!M9=\"\",女子入力シート!N9=\"\"),\"\",女子入力シート!L9&\"・\"&女子入力シート!M9&\"・\"&女子入力シート!N9)","v":""}]
[null,null,{"$f":"IF(女子入力シート!D9=\"\",\"\",女子入力シート!D9)","v":""},null,{"$f":"IF(女子入力シート!E9=\"\",\"\",女子入力シート!E9)","v":""}]
[null,"中堅",{"$f":"IF(女子入力シート!F10=\"\",\"\",女子入力シート!F10)","v":""},null,{"$f":"IF(女子入力シート!G10=\"\",\"\",女子入力シート!G10)","v":""},{"$f":"IF(女子入力シート!H10=\"\",\"\",女子入力シート!H10)","v":""},{"$f":"IF(女子入力シート!I10=\"\",\"\",女子入力シート!I10)","v":""},{"$f":"IF(女子入力シート!J10=\"\",\"\",女子入力シート!J10)","v":""},{"$f":"IF(女子入力シート!K10=\"\",\"\",女子入力シート!K10)","v":""},{"$f":"IF(OR(女子入力シート!L10=\"\",女子入力シート!M10=\"\",女子入力シート!N10=\"\"),\"\",女子入力シート!L10&\"・\"&女子入力シート!M10&\"・\"&女子入力シート!N10)","v":""}]
[null,null,{"$f":"IF(女子入力シート!D10=\"\",\"\",女子入力シート!D10)","v":""},null,{"$f":"IF(女子入力シート!E10=\"\",\"\",女子入力シート!E10)","v":""}]
{"$rows_left_out":7}
{"sheet":"申込書＿男子個人","index":8,"n_rows":27,"n_cols":13,"rows_kept":27,"cut":false,"hidden":false,"merged":[[24,5,24,7],[24,8,24,10],[24,11,24,12],[25,5,25,6],[26,5,26,6],[7,5,7,7],[7,8,7,10],[7,11,7,12],[8,5,8,6],[23,5,23,7],[23,8,23,10],[23,11,23,12],[9,5,9,6],[16,8,17,8],[21,6,21,10],[22,7,22,12],[4,6,4,10],[5,7,5,12],[6,5,6,7],[6,8,6,10],[6,11,6,12]]}
[]
[null,{"$f":"MAX(B3:B9)","v":0}]
[1,{"$f":"男子入力シート!B23","v":""},23]
[2,{"$f":"男子入力シート!B24","v":""},24]
[3,{"$f":"男子入力シート!B25","v":""},null,null,null,null,"個　人　試　合　申　込　書",null,null,null,null,null,{"$f":"NOW()","v":"2026-03-24T17:32:13.950"}]
[4,{"$f":"男子入力シート!B26","v":""},null,null,"※抽選番号",null,{"$f":"INDIRECT(\"男子入力シート!C\"&$C$3)&\"kg級\"","v":"60kg級"},{"$f":"男子入力シート!$E$6","v":"第73回大阪私立高等学校総合体育大会　申込書"}]
[5,{"$f":"男子入力シート!B27","v":""},null,null,"学校番号","学　　校　　名",null,null,"監　督　名",null,null,"校　長　名"]
[6,{"$f":"男子入力シート!B28","v":""},null,null,{"$f":"IF(男子入力シート!$C$2=\"\",\"\",男子入力シート!$C$2)","v":""},{"$f":"男子入力シート!$D$2","v":"学校番号が入力されていません。"},null,null,{"$f":"IF(男子入力シート!$D$4=\"\",\"監督名が入力されていません\",男子入力シート!$D$4)","v":"監督名が入力されていません"},null,null,{"$f":"IF(男子入力シート!$F$4=\"\",\"校長名が入力されていません\",男子入力シート!$F$4)","v":"校長名が入力されていません"}]
[7,{"$f":"男子入力シート!B29","v":""},null,null,"ふりがな",{"$f":"IF(INDIRECT(\"男子入力シート!F\"&$C$3)=\"\",\"\",INDIRECT(\"男子入力シート!F\"&$C$3))","v":""},null,{"$f":"IF(INDIRECT(\"男子入力シート!G\"&$C$3)=\"\",\"\",INDIRECT(\"男子入力シート!G\"&$C$3))","v":""},"学年","段位","体重(kg)","身長(cm)","生年月日(西暦)"]
[null,null,null,null,"選手名",{"$f":"IF(INDIRECT(\"男子入力シート!D\"&$C$3)=\"\",\"\",INDIRECT(\"男子入力シート!D\"&$C$3))","v":""},null,{"$f":"IF(INDIRECT(\"男子入力シート!E\"&$C$3)=\"\",\"\",INDIRECT(\"男子入力シート!E\"&$C$3))","v":""},{"$f":"IF(INDIRECT(\"男子入力シート!H\"&$C$3)=\"\",\"\",INDIRECT(\"男子入力シート!H\"&$C$3))","v":""},{"$f":"IF(INDIRECT(\"男子入力シート!I\"&$C$3)=\"\",\"\",INDIRECT(\"男子入力シート!I\"&$C$3))","v":""},{"$f":"IF(INDIRECT(\"男子入力シート!J\"&$C$3)=\"\",\"\",INDIRECT(\"男子入力シート!J\"&$C$3))","v":""},{"$f":"IF(INDIRECT(\"男子入力シート!K\"&$C$3)=\"\",\"\",INDIRECT(\"男子入力シート!K\"&$C$3))","v":""},{"$f":"IF(OR(INDIRECT(\"男子入力シート!L\"&$C$3)=\"\",INDIRECT(\"男子入力シート!M\"&$C$3)=\"\",INDIRECT(\"男子入力シート!N\"&$C$3)=\"\"),\"\",INDIRECT(\"男子入力シート!L\"&$C$3)&\"・\"&INDIRECT(\"男子入力シート!M\"&$C$3)&\"・\"&INDIRECT(\"男子入力シート!N\"&$C$3))","v":""}]
{"$rows_left_out":18}
{"sheet":"申込書＿女子個人","index":9,"n_rows":27,"n_cols":13,"rows_kept":27,"cut":false,"hidden":false,"merged":[[23,5,23,7],[23,8,23,10],[23,11,23,12],[4,6,4,10],[5,7,5,12],[6,5,6,7],[6,8,6,10],[6,11,6,12],[7,5,7,7],[7,8,7,10],[7,11,7,12],[8,5,8,6],[9,5,9,6],[16,8,17,8],[21,6,21,10],[22,7,22,12],[24,5,24,7],[24,8,24,10],[24,11,24,12],[25,5,25,6],[26,5,26,6]]}
[]
[null,{"$f":"MAX(B3:B16)","v":0}]
[1,{"$f":"女子入力シート!B20","v":""},20]
[2,{"$f":"女子入力シート!B21","v":""},21]
[3,{"$f":"女子入力シート!B22","v":""},null,null,null,null,"個　人　試　合　申　込　書",null,null,null,null,null,{"$f":"NOW()","v":"2026-03-24T17:32:13.950"}]
[4,{"$f":"女子入力シート!B23","v":""},null,null,"※抽選番号",null,{"$f":"IF(INDIRECT(\"女子入力シート!C\"&$C$3)=\"無差別\",\"無差別\",INDIRECT(\"女子入力シート!C\"&$C$3)&\"kg級\")","v":"kg級"},{"$f":"女子入力シート!$E$6","v":"第73回大阪私立高等学校総合体育大会　申込書"}]
[5,{"$f":"女子入力シート!B24","v":""},null,null,"学校番号","学　　校　　名",null,null,"監　督　名",null,null,"校　長　名"]
[6,{"$f":"女子入力シート!B25","v":""},null,null,{"$f":"IF(女子入力シート!$C$2=\"\",\"\",女子入力シート!$C$2)","v":""},{"$f":"女子入力シート!$D$2","v":"学校番号が入力されていません。"},null,null,{"$f":"IF(女子入力シート!$D$4=\"\",\"監督名が入力されていません\",女子入力シート!$D$4)","v":"監督名が入力されていません"},null,null,{"$f":"IF(女子入力シート!$F$4=\"\",\"校長名が入力されていません\",女子入力シート!$F$4)","v":"校長名が入力されていません"}]
[null,null,null,null,"ふりがな",{"$f":"IF(INDIRECT(\"女子入力シート!F\"&$C$3)=\"\",\"\",INDIRECT(\"女子入力シート!F\"&$C$3))","v":""},null,{"$f":"IF(INDIRECT(\"女子入力シート!G\"&$C$3)=\"\",\"\",INDIRECT(\"女子入力シート!G\"&$C$3))","v":""},"学年","段位","体重(kg)","身長(cm)","生年月日(西暦)"]
[null,null,null,null,"選手名",{"$f":"IF(INDIRECT(\"女子入力シート!D\"&$C$3)=\"\",\"\",INDIRECT(\"女子入力シート!D\"&$C$3))","v":""},null,{"$f":"IF(INDIRECT(\"女子入力シート!E\"&$C$3)=\"\",\"\",INDIRECT(\"女子入力シート!E\"&$C$3))","v":""},{"$f":"IF(INDIRECT(\"女子入力シート!H\"&$C$3)=\"\",\"\",INDIRECT(\"女子入力シート!H\"&$C$3))","v":""},{"$f":"IF(INDIRECT(\"女子入力シート!I\"&$C$3)=\"\",\"\",INDIRECT(\"女子入力シート!I\"&$C$3))","v":""},{"$f":"IF(INDIRECT(\"女子入力シート!J\"&$C$3)=\"\",\"\",INDIRECT(\"女子入力シート!J\"&$C$3))","v":""},{"$f":"IF(INDIRECT(\"女子入力シート!K\"&$C$3)=\"\",\"\",INDIRECT(\"女子入力シート!K\"&$C$3))","v":""},{"$f":"IF(OR(INDIRECT(\"女子入力シート!L\"&$C$3)=\"\",INDIRECT(\"女子入力シート!M\"&$C$3)=\"\",INDIRECT(\"女子入力シート!N\"&$C$3)=\"\"),\"\",INDIRECT(\"女子入力シート!L\"&$C$3)&\"・\"&INDIRECT(\"女子入力シート!M\"&$C$3)&\"・\"&INDIRECT(\"女子入力シート!N\"&$C$3))","v":""}]
{"$rows_left_out":18}
{"sheet":"申込選手一覧（個人）","index":10,"n_rows":21,"n_cols":10,"rows_kept":21,"cut":false,"hidden":false,"merged":[]}
[null,"階級","学校名","エントリー用","姓","名","ふりがな","学年","段位","学校番号"]
[1,{"$f":"IF(男子入力シート!C23=\"\",\"\",男子入力シート!C23)","v":60},{"$f":"IF(E2=\"\",\"\",VLOOKUP(男子入力シート!$C$2,校名[],3,FALSE))","v":""},{"$f":"IF(E2=\"\",\"\",E2&\"　\"&F2&\"（\"&I2&\"）\")","v":""},{"$f":"IF(男子入力シート!D23=\"\",\"\",男子入力シート!D23)","v":""},{"$f":"IF(男子入力シート!E23=\"\",\"\",男子入力シート!E23)","v":""},{"$f":"IF(E2=\"\",\"\",男子入力シート!F23&\"　\"&男子入力シート!G23)","v":""},{"$f":"IF(E2=\"\",\"\",男子入力シート!H23)","v":""},{"$f":"IF(E2=\"\",\"\",IF(男子入力シート!I23=0,\"無\",男子入力シート!I23))","v":""},{"$f":"IF(E2=\"\",\"\",男子入力シート!$C$2)","v":""}]
[2,{"$f":"IF(男子入力シート!C24=\"\",\"\",男子入力シート!C24)","v":66},{"$f":"IF(E3=\"\",\"\",VLOOKUP(男子入力シート!$C$2,校名[],3,FALSE))","v":""},"",{"$f":"IF(男子入力シート!D24=\"\",\"\",男子入力シート!D24)","v":""},{"$f":"IF(男子入力シート!E24=\"\",\"\",男子入力シート!E24)","v":""},{"$f":"IF(E3=\"\",\"\",男子入力シート!F24&\"　\"&男子入力シート!G24)","v":""},{"$f":"IF(E3=\"\",\"\",男子入力シート!H24)","v":""},{"$f":"IF(E3=\"\",\"\",IF(男子入力シート!I24=0,\"無\",男子入力シート!I24))","v":""},{"$f":"IF(E3=\"\",\"\",男子入力シート!$C$2)","v":""}]
[3,{"$f":"IF(男子入力シート!C25=\"\",\"\",男子入力シート!C25)","v":73},{"$f":"IF(E4=\"\",\"\",VLOOKUP(男子入力シート!$C$2,校名[],3,FALSE))","v":""},"",{"$f":"IF(男子入力シート!D25=\"\",\"\",男子入力シート!D25)","v":""},{"$f":"IF(男子入力シート!E25=\"\",\"\",男子入力シート!E25)","v":""},{"$f":"IF(E4=\"\",\"\",男子入力シート!F25&\"　\"&男子入力シート!G25)","v":""},{"$f":"IF(E4=\"\",\"\",男子入力シート!H25)","v":""},{"$f":"IF(E4=\"\",\"\",IF(男子入力シート!I25=0,\"無\",男子入力シート!I25))","v":""},{"$f":"IF(E4=\"\",\"\",男子入力シート!$C$2)","v":""}]
[4,{"$f":"IF(男子入力シート!C26=\"\",\"\",男子入力シート!C26)","v":81},{"$f":"IF(E5=\"\",\"\",VLOOKUP(男子入力シート!$C$2,校名[],3,FALSE))","v":""},"",{"$f":"IF(男子入力シート!D26=\"\",\"\",男子入力シート!D26)","v":""},{"$f":"IF(男子入力シート!E26=\"\",\"\",男子入力シート!E26)","v":""},{"$f":"IF(E5=\"\",\"\",男子入力シート!F26&\"　\"&男子入力シート!G26)","v":""},{"$f":"IF(E5=\"\",\"\",男子入力シート!H26)","v":""},{"$f":"IF(E5=\"\",\"\",IF(男子入力シート!I26=0,\"無\",男子入力シート!I26))","v":""},{"$f":"IF(E5=\"\",\"\",男子入力シート!$C$2)","v":""}]
[5,{"$f":"IF(男子入力シート!C27=\"\",\"\",男子入力シート!C27)","v":90},{"$f":"IF(E6=\"\",\"\",VLOOKUP(男子入力シート!$C$2,校名[],3,FALSE))","v":""},"",{"$f":"IF(男子入力シート!D27=\"\",\"\",男子入力シート!D27)","v":""},{"$f":"IF(男子入力シート!E27=\"\",\"\",男子入力シート!E27)","v":""},{"$f":"IF(E6=\"\",\"\",男子入力シート!F27&\"　\"&男子入力シート!G27)","v":""},{"$f":"IF(E6=\"\",\"\",男子入力シート!H27)","v":""},{"$f":"IF(E6=\"\",\"\",IF(男子入力シート!I27=0,\"無\",男子入力シート!I27))","v":""},{"$f":"IF(E6=\"\",\"\",男子入力シート!$C$2)","v":""}]
[6,{"$f":"IF(男子入力シート!C28=\"\",\"\",男子入力シート!C28)","v":100},{"$f":"IF(E7=\"\",\"\",VLOOKUP(男子入力シート!$C$2,校名[],3,FALSE))","v":""},"",{"$f":"IF(男子入力シート!D28=\"\",\"\",男子入力シート!D28)","v":""},{"$f":"IF(男子入力シート!E28=\"\",\"\",男子入力シート!E28)","v":""},{"$f":"IF(E7=\"\",\"\",男子入力シート!F28&\"　\"&男子入力シート!G28)","v":""},{"$f":"IF(E7=\"\",\"\",男子入力シート!H28)","v":""},{"$f":"IF(E7=\"\",\"\",IF(男子入力シート!I28=0,\"無\",男子入力シート!I28))","v":""},{"$f":"IF(E7=\"\",\"\",男子入力シート!$C$2)","v":""}]
[7,{"$f":"IF(男子入力シート!C29=\"\",\"\",男子入力シート!C29)","v":"100+"},{"$f":"IF(E8=\"\",\"\",VLOOKUP(男子入力シート!$C$2,校名[],3,FALSE))","v":""},"",{"$f":"IF(男子入力シート!D29=\"\",\"\",男子入力シート!D29)","v":""},{"$f":"IF(男子入力シート!E29=\"\",\"\",男子入力シート!E29)","v":""},{"$f":"IF(E8=\"\",\"\",男子入力シート!F29&\"　\"&男子入力シート!G29)","v":""},{"$f":"IF(E8=\"\",\"\",男子入力シート!H29)","v":""},{"$f":"IF(E8=\"\",\"\",IF(男子入力シート!I29=0,\"無\",男子入力シート!I29))","v":""},{"$f":"IF(E8=\"\",\"\",男子入力シート!$C$2)","v":""}]
[8,{"$f":"IF(男子入力シート!C30=\"\",\"\",男子入力シート!C30)","v":""},{"$f":"IF(E9=\"\",\"\",VLOOKUP(男子入力シート!$C$2,校名[],3,FALSE))","v":""},"",{"$f":"IF(男子入力シート!D30=\"\",\"\",男子入力シート!D30)","v":""},{"$f":"IF(男子入力シート!E30=\"\",\"\",男子入力シート!E30)","v":""},{"$f":"IF(E9=\"\",\"\",男子入力シート!F30&\"　\"&男子入力シート!G30)","v":""},{"$f":"IF(E9=\"\",\"\",男子入力シート!H30)","v":""},{"$f":"IF(E9=\"\",\"\",IF(男子入力シート!I30=0,\"無\",男子入力シート!I30))","v":""},{"$f":"IF(E9=\"\",\"\",男子入力シート!$C$2)","v":""}]
[9,{"$f":"IF(男子入力シート!C31=\"\",\"\",男子入力シート!C31)","v":""},{"$f":"IF(E10=\"\",\"\",VLOOKUP(男子入力シート!$C$2,校名[],3,FALSE))","v":""},"",{"$f":"IF(男子入力シート!D31=\"\",\"\",男子入力シート!D31)","v":""},{"$f":"IF(男子入力シート!E31=\"\",\"\",男子入力シート!E31)","v":""},{"$f":"IF(E10=\"\",\"\",男子入力シート!F31&\"　\"&男子入力シート!G31)","v":""},{"$f":"IF(E10=\"\",\"\",男子入力シート!H31)","v":""},{"$f":"IF(E10=\"\",\"\",IF(男子入力シート!I31=0,\"無\",男子入力シート!I31))","v":""},{"$f":"IF(E10=\"\",\"\",男子入力シート!$C$2)","v":""}]
{"$rows_left_out":12}
{"sheet":"申込選手一覧sort（個人）","index":11,"n_rows":2,"n_cols":9,"rows_kept":2,"cut":false,"hidden":false,"merged":[]}
["階級","学校名","エントリー用","姓","名","ふりがな","学年","段位","学校番号"]
[{"$f":"_xlfn._xlws.SORT(_xlfn._xlws.FILTER('申込選手一覧（個人）'!B2:J21,'申込選手一覧（個人）'!C2:C21<>\"\",\"\"),1)","v":""}]

{"sheet":"プログラム","index":12,"n_rows":22,"n_cols":36,"rows_kept":22,"cut":false,"hidden":false,"merged":[[1,3,1,6],[2,5,2,6],[9,1,9,2],[10,1,10,2],[11,1,11,2],[4,1,4,2],[5,1,5,2],[6,1,6,2],[7,1,7,2],[8,1,8,2],[20,1,20,2],[21,1,21,2],[14,3,14,6],[15,5,15,6],[17,1,17,2],[18,1,18,2],[19,1,19,2]]}
[]
[null,"No.",null,{"$f":"IF(男子入力シート!C2=\"\",\"\",男子入力シート!D2)","v":""}]
[null,null,null,null,"監督：",{"$f":"IF(男子入力シート!D4=\"\",\"\",男子入力シート!D4)","v":""},null,{"$f":"IF(男子入力シート!I9=\"\",\"\",男子入力シート!I9)","v":""},"昇段用データ",null,"男子",null,null,null,null,null,null,null,null,null,null,null,null,null,null,null,"女子"]
[null,null,null,"名前","段","体重","身長",{"$f":"IF(男子入力シート!I10=\"\",\"\",男子入力シート!I10)","v":""},"男子高校名","女子高校名","先","次","中","副","大","補1","補2","補3","先　段","次　段","中　段","副　段","大　段","補1　　段","補2　段","補3　段","先","中","大","補1","補2","先　段","中　段","大　段","補1　　段","補2　段"]
[null,"先　鋒",null,{"$f":"IF(男子入力シート!D9=\"\",\"\",男子入力シート!D9&\"　\"&男子入力シート!E9)","v":""},{"$f":"IF(男子入力シート!I9=\"\",\"\",男子入力シート!I9)","v":""},{"$f":"IF(男子入力シート!K9=\"\",\"\",男子入力シート!J9)","v":""},{"$f":"IF(男子入力シート!L9=\"\",\"\",男子入力シート!K9)","v":""},{"$f":"IF(男子入力シート!I11=\"\",\"\",男子入力シート!I11)","v":""},{"$f":"D2","v":""},{"$f":"D15","v":""},{"$f":"D5","v":""},{"$f":"D6","v":""},{"$f":"D7","v":""},{"$f":"D8","v":""},{"$f":"D9","v":""},{"$f":"D10","v":""},{"$f":"D11","v":""},{"$f":"D12","v":""},{"$f":"E5","v":""},{"$f":"E6","v":""},{"$f":"E7","v":""},{"$f":"E8","v":""},{"$f":"E9","v":""},{"$f":"E10","v":""},{"$f":"E11","v":""},{"$f":"E12","v":""},{"$f":"D18","v":""},{"$f":"D19","v":""},{"$f":"D20","v":""},{"$f":"D21","v":""},{"$f":"D22","v":""},{"$f":"E18","v":""},{"$f":"E19","v":""},{"$f":"E20","v":""},{"$f":"E21","v":""},{"$f":"E22","v":""}]
[null,"次　鋒",null,{"$f":"IF(男子入力シート!D10=\"\",\"\",男子入力シート!D10&\"　\"&男子入力シート!E10)","v":""},{"$f":"IF(男子入力シート!I10=\"\",\"\",男子入力シート!I10)","v":""},{"$f":"IF(男子入力シート!K10=\"\",\"\",男子入力シート!J10)","v":""},{"$f":"IF(男子入力シート!L10=\"\",\"\",男子入力シート!K10)","v":""},{"$f":"IF(男子入力シート!I12=\"\",\"\",男子入力シート!I12)","v":""}]
[null,"中　堅",null,{"$f":"IF(男子入力シート!D11=\"\",\"\",男子入力シート!D11&\"　\"&男子入力シート!E11)","v":""},{"$f":"IF(男子入力シート!I11=\"\",\"\",男子入力シート!I11)","v":""},{"$f":"IF(男子入力シート!K11=\"\",\"\",男子入力シート!J11)","v":""},{"$f":"IF(男子入力シート!L11=\"\",\"\",男子入力シート!K11)","v":""},{"$f":"IF(男子入力シート!I13=\"\",\"\",男子入力シート!I13)","v":""}]
[null,"副　将",null,{"$f":"IF(男子入力シート!D12=\"\",\"\",男子入力シート!D12&\"　\"&男子入力シート!E12)","v":""},{"$f":"IF(男子入力シート!I12=\"\",\"\",男子入力シート!I12)","v":""},{"$f":"IF(男子入力シート!K12=\"\",\"\",男子入力シート!J12)","v":""},{"$f":"IF(男子入力シート!L12=\"\",\"\",男子入力シート!K12)","v":""},{"$f":"IF(男子入力シート!I14=\"\",\"\",男子入力シート!I14)","v":""}]
[null,"大　将",null,{"$f":"IF(男子入力シート!D13=\"\",\"\",男子入力シート!D13&\"　\"&男子入力シート!E13)","v":""},{"$f":"IF(男子入力シート!I13=\"\",\"\",男子入力シート!I13)","v":""},{"$f":"IF(男子入力シート!K13=\"\",\"\",男子入力シート!J13)","v":""},{"$f":"IF(男子入力シート!L13=\"\",\"\",男子入力シート!K13)","v":""},{"$f":"IF(男子入力シート!I15=\"\",\"\",男子入力シート!I15)","v":""}]
[null,"補欠１",null,{"$f":"IF(男子入力シート!D14=\"\",\"\",男子入力シート!D14&\"　\"&男子入力シート!E14)","v":""},{"$f":"IF(男子入力シート!I14=\"\",\"\",男子入力シート!I14)","v":""},{"$f":"IF(男子入力シート!K14=\"\",\"\",男子入力シート!J14)","v":""},{"$f":"IF(男子入力シート!L14=\"\",\"\",男子入力シート!K14)","v":""}]
{"$rows_left_out":12}